Target
Metabotropic glutamate receptor 4
Ligand
BDBM402255
Substrate
Meas. Tech.
Ca2+ Mobilization In Vitro Assay
EC50
173±n/a nM
Citation
 Jaeschke, GO Hara, FPlancher, JRicci, ARueher, DVieira, E Ethynyl derivatives US Patent  US10011607 Publication Date 7/3/2018 
Target
Name:
Metabotropic glutamate receptor 4
Synonyms:
GPRC1D GRM4_HUMAN MGLUR4 Metabotropic glutamate receptor 4 (mGlu4) metabotropic glutamate 4
Type:
Protein
Mol. Mass.:
101899.95
Organism:
Homo sapiens (Human)
Description:
Q14833
Residue:
912
  
Inhibitor
Name:
BDBM402255
Synonyms:
(9aRS)-7-[2,6-difluoro-4-(2- phenylethynyl)phenyl]-9a- methyl-2-(m-tolylmethyl)-4,9- dihydro-3H-pyrazino[1,2- c]pyrimidine-1,6,8-trione | US10011607, 83
Type:
Small organic molecule
Emp. Form.:
C30H25F2N3O3
Mol. Mass.:
513.5346
SMILES:
Cc1cccc(CN2CCN3C(=O)N(C(=O)CC3(C)C2=O)c2c(F)cc(cc2F)C#Cc2ccccc2)c1
: