Target
Metabotropic glutamate receptor 4
Ligand
BDBM402272
Substrate
Meas. Tech.
Ca2+ Mobilization In Vitro Assay
EC50
219±n/a nM
Citation
 Jaeschke, GO Hara, FPlancher, JRicci, ARueher, DVieira, E Ethynyl derivatives US Patent  US10011607 Publication Date 7/3/2018 
Target
Name:
Metabotropic glutamate receptor 4
Synonyms:
GPRC1D GRM4_HUMAN MGLUR4 Metabotropic glutamate receptor 4 (mGlu4) metabotropic glutamate 4
Type:
Protein
Mol. Mass.:
101899.95
Organism:
Homo sapiens (Human)
Description:
Q14833
Residue:
912
  
Inhibitor
Name:
BDBM402272
Synonyms:
(9aS)-7-[2,6-difluoro-4-(2- phenylethynyl)phenyl]-9a- methyl-2-[2-(2- methylpyrazol-3-yl)ethyl]- 4,9-dihydro-3H-pyrazino[1,2- c]pyrimidine-1,6,8-trione | US10011607, 100
Type:
Small organic molecule
Emp. Form.:
C28H25F2N5O3
Mol. Mass.:
517.5266
SMILES:
Cn1nccc1CCN1CCN2C(=O)N(C(=O)C[C@@]2(C)C1=O)c1c(F)cc(cc1F)C#Cc1ccccc1
: