Target
Metabotropic glutamate receptor 4
Ligand
BDBM402276
Substrate
Meas. Tech.
Ca2+ Mobilization In Vitro Assay
EC50
273±n/a nM
Citation
 Jaeschke, GO Hara, FPlancher, JRicci, ARueher, DVieira, E Ethynyl derivatives US Patent  US10011607 Publication Date 7/3/2018 
Target
Name:
Metabotropic glutamate receptor 4
Synonyms:
GPRC1D GRM4_HUMAN MGLUR4 Metabotropic glutamate receptor 4 (mGlu4) metabotropic glutamate 4
Type:
Protein
Mol. Mass.:
101899.95
Organism:
Homo sapiens (Human)
Description:
Q14833
Residue:
912
  
Inhibitor
Name:
BDBM402276
Synonyms:
(9aRS)-7-[2,6-difluoro-4-(2- phenylethynyl)phenyl]-9a- (methoxymethyl)-2-(1- methylpyrazol-4-yl)-4,9- dihydro- 3H-pyrazino[1,2- c]pyrimidine-1,6,8-trione | US10011607, 104
Type:
Small organic molecule
Emp. Form.:
C27H23F2N5O4
Mol. Mass.:
519.4994
SMILES:
COCC12CC(=O)N(C(=O)N1CCN(c1cnn(C)c1)C2=O)c1c(F)cc(cc1F)C#Cc1ccccc1
: