Target
Histone deacetylase 3/Nuclear receptor corepressor 2 [395-489]
Ligand
BDBM19149
Substrate
Meas. Tech.
Biochemical Assay
IC50
435±n/a nM
Citation
 Ma, HWang, Y Histone deacetylase inhibitors and methods for use thereof US Patent  US10011611 Publication Date 7/3/2018 
Target
Name:
Histone deacetylase 3/Nuclear receptor corepressor 2 [395-489]
Synonyms:
HDAC3/NCOR2
Type:
Protein
Mol. Mass.:
Description:
Components:
This complex has 2 components.
Component 1
Name:
Histone deacetylase 3
Synonyms:
HD3 HDAC3_HUMAN Human HDAC3 SMAP45
Type:
Enzyme
Mol. Mass.:
48829.55
Organism:
Homo sapiens (Human)
Description:
O15379
Residue:
428
  
Component 2
Name:
Nuclear receptor corepressor 2 [395-489]
Synonyms:
CTG26 NCOR2_HUMAN | Nuclear receptor corepressor 2 (NCOR2)(aa 395-489)
Type:
Enzyme Catalytic Domain
Mol. Mass.:
11648.02
Organism:
Homo sapiens (Human)
Description:
aa 395-489
Residue:
95
  
Inhibitor
Name:
BDBM19149
Synonyms:
CHEMBL98 SAHA US10188756, Compound SAHA US11505523, Compound SAHA US9353061, SAHA US9695181, Vorinostat Zolinza suberoylanilide hydroxamic acid
Type:
Small organic molecule
Emp. Form.:
C14H20N2O3
Mol. Mass.:
264.3202
SMILES:
ONC(=O)CCCCCCC(=O)Nc1ccccc1
: