Target
Alpha-carbonic anhydrase domain-containing protein
Ligand
BDBM25912
Substrate
BDBM10856
Meas. Tech.
CA Inhibition Assay
pH
7.4±n/a
Temperature
298.15±n/a K
Ki
10.1±n/a nM
Citation
 Güzel, OInnocenti, AHall, RAScozzafava, AMühlschlegel, FASupuran, CT Carbonic anhydrase inhibitors. The nematode alpha-carbonic anhydrase of Caenorhabditis elegans CAH-4b is highly inhibited by 2-(hydrazinocarbonyl)-3-substituted-phenyl-1H-indole-5-sulfonamides. Bioorg Med Chem 17:3212-5 (2009)  
Target
Name:
Alpha-carbonic anhydrase domain-containing protein
Synonyms:
CAH-4b ceCA
Type:
Enzyme
Mol. Mass.:
26169.24
Organism:
Caenorhabditis elegans
Description:
Q8WQD8
Residue:
235
  
Inhibitor
Name:
BDBM25912
Synonyms:
3-(3-chlorophenyl)-2-(hydrazinecarbonyl)-1H-indole-5-sulfonamide indole sulfonamide, 8h
Type:
Small organic molecule
Emp. Form.:
C15H13ClN4O3S
Mol. Mass.:
364.807
SMILES:
NNC(=O)c1[nH]c2ccc(cc2c1-c1cccc(Cl)c1)S(N)(=O)=O
:
Substrate
Name:
BDBM10856
Synonyms:
Carbon Dioxide | methanedione
Type:
Small organic molecule
Emp. Form.:
CO2
Mol. Mass.:
44.0095
SMILES:
O=C=O
: