Target
Dimer of Gag-Pol polyprotein [514-612]
Ligand
BDBM857
Substrate
HIV Protease Peptide Substrate
Meas. Tech.
Protease Inhibition Assay
pH
4.7±n/a
Temperature
310.15±n/a K
Ki
19±n/a nM
Citation
 Ettmayer, PBillich, AHecht, PRosenwirth, BGstach, H Paracyclophanes: a novel class of water-soluble inhibitors of HIV proteinase. J Med Chem 39:3291-9 (1996)  
Target
Name:
Dimer of Gag-Pol polyprotein [514-612]
Synonyms:
HIV-2 Protease
Type:
Protein Complex
Mol. Mass.:
Description:
Components:
This complex has 2 components.
Component 1
Name:
Gag-Pol polyprotein [514-612]
Synonyms:
HIV-2 Protease chain A POL_HV2RO | gag-pol
Type:
Enzyme Subunit
Mol. Mass.:
10718.25
Organism:
Human immunodeficiency virus type 2
Description:
P04584[514-612]
Residue:
99
  
Component 2
Name:
Gag-Pol polyprotein [514-612]
Synonyms:
HIV-2 Protease chain A POL_HV2RO | gag-pol
Type:
Enzyme Subunit
Mol. Mass.:
10718.25
Organism:
Human immunodeficiency virus type 2
Description:
P04584[514-612]
Residue:
99
  
Inhibitor
Name:
BDBM857
Synonyms:
1OH-2(Cbz-Tle)3PhPr [14]paracyclophane deriv. 3 | benzyl N-[(1S)-1-{[(1S,2S)-1-[(10R,13R)-9,12-dioxo-10-(propan-2-yl)-2,5-dioxa-8,11,14-triazabicyclo[14.2.2]icosa-1(18),16,19-trien-13-yl]-1-hydroxy-3-phenylpropan-2-yl]carbamoyl}-2-methylpropyl]carbamate
Type:
Small organic molecule
Emp. Form.:
C40H53N5O8
Mol. Mass.:
731.8775
SMILES:
CC(C)[C@H](NC(=O)OCc1ccccc1)C(=O)N[C@@H](Cc1ccccc1)C(O)[C@H]1NCc2ccc(OCCOCCNC(=O)C(NC1=O)C(C)C)cc2
:
Substrate
Name:
HIV Protease Peptide Substrate
Synonyms:
Type:
Peptide
Mol. Mass.:
3062.94
Organism:
Synthesized
Description:
Residue:
29