Target
Adenosine receptor A2b
Ligand
BDBM35836
Substrate
BDBM10852
Meas. Tech.
Radioligand Binding Assay
Ki
798±n/a nM
Citation
 Gillespie, RJBamford, SJClay, AGaur, SHaymes, TJackson, PSJordan, AMKlenke, BLeonardi, SLiu, JMansell, HLNg, SSaadi, MSimmonite, HStratton, GCTodd, RSWilliamson, DSYule, IA Antagonists of the human A(2A) receptor. Part 6: Further optimization of pyrimidine-4-carboxamides. Bioorg Med Chem 17:6590-605 (2009)  
Target
Name:
Adenosine receptor A2b
Synonyms:
AA2BR_HUMAN ADORA2B Adenosine receptors A2b | Adenosine receptors; A2a & A2b
Type:
G Protein-Coupled Receptor (GPCR)
Mol. Mass.:
36341.22
Organism:
Homo sapiens (Human)
Description:
Residue:
332
  
Inhibitor
Name:
BDBM35836
Synonyms:
pyrimidine-4-carboxamide, 118
Type:
Small organic molecule
Emp. Form.:
C14H14N6O2
Mol. Mass.:
298.3
SMILES:
Cc1ccc(o1)-c1cc(nc(N)n1)C(=O)NCc1ncc[nH]1
:
Substrate