Target
Rho-associated protein kinase 2 [1-119]
Ligand
BDBM402301
Substrate
Meas. Tech.
Biological Assay
IC50
100.0±n/a nM
Citation
 Zhao, YWang, HLi, GJiang, YLi, XZhou, LLiu, Y Rho-associated protein kinase inhibitor, pharmaceutical composition comprising the same, as well as preparation method and use thereof US Patent  US10329282 Publication Date 6/25/2019 
Target
Name:
Rho-associated protein kinase 2 [1-119]
Synonyms:
KIAA0619 ROCK2 (aa 1-119) Rho-associated protein kinase 2 (ROCK2)
Type:
Enzyme Catalytic Domain
Mol. Mass.:
13160.63
Organism:
Homo sapiens (Human)
Description:
O75116[1-119]
Residue:
119
  
Inhibitor
Name:
BDBM402301
Synonyms:
US10329282, Compound TDI01111 | US11390609, Compound TDI01111
Type:
Small organic molecule
Emp. Form.:
C23H18N6OS
Mol. Mass.:
426.494
SMILES:
O=C(NC1CC1)c1cc2ccc(cc2s1)-c1nccc(Nc2ccc3[nH]ncc3c2)n1
: