Target
Rho-associated protein kinase 2 [1-119]
Ligand
BDBM402312
Substrate
Meas. Tech.
Biological Assay
IC50
62.0±n/a nM
Citation
 Zhao, YWang, HLi, GJiang, YLi, XZhou, LLiu, Y Rho-associated protein kinase inhibitor, pharmaceutical composition comprising the same, as well as preparation method and use thereof US Patent  US10329282 Publication Date 6/25/2019 
Target
Name:
Rho-associated protein kinase 2 [1-119]
Synonyms:
KIAA0619 ROCK2 (aa 1-119) Rho-associated protein kinase 2 (ROCK2)
Type:
Enzyme Catalytic Domain
Mol. Mass.:
13160.63
Organism:
Homo sapiens (Human)
Description:
O75116[1-119]
Residue:
119
  
Inhibitor
Name:
BDBM402312
Synonyms:
US10329282, Compound TDI01134 | US11390609, Compound TDI01134
Type:
Small organic molecule
Emp. Form.:
C24H19N9O
Mol. Mass.:
449.4674
SMILES:
Cn1cc(NC(=O)c2cc3ccc(cc3[nH]2)-c2nccc(Nc3ccc4[nH]ncc4c3)n2)cn1
: