Target
Rho-associated protein kinase 2 [1-119]
Ligand
BDBM399184
Substrate
Meas. Tech.
Biological Assay
IC50
135±n/a nM
Citation
 Zhao, YWang, HLi, GJiang, YLi, XZhou, LLiu, Y Rho-associated protein kinase inhibitor, pharmaceutical composition comprising the same, as well as preparation method and use thereof US Patent  US10329282 Publication Date 6/25/2019 
Target
Name:
Rho-associated protein kinase 2 [1-119]
Synonyms:
KIAA0619 ROCK2 (aa 1-119) Rho-associated protein kinase 2 (ROCK2)
Type:
Enzyme Catalytic Domain
Mol. Mass.:
13160.63
Organism:
Homo sapiens (Human)
Description:
O75116[1-119]
Residue:
119
  
Inhibitor
Name:
BDBM399184
Synonyms:
US10323023, Compound TDI01236 | US11390609, Compound TDI01236
Type:
Small organic molecule
Emp. Form.:
C25H17N9O
Mol. Mass.:
459.4622
SMILES:
O=C(Nc1ccnnc1)c1ccc2ccc(cc2n1)-c1nccc(Nc2ccc3[nH]ncc3c2)n1
: