Target
Rho-associated protein kinase 2 [1-119]
Ligand
BDBM399187
Substrate
Meas. Tech.
Biological Assay
IC50
101±n/a nM
Citation
 Zhao, YWang, HLi, GJiang, YLi, XZhou, LLiu, Y Rho-associated protein kinase inhibitor, pharmaceutical composition comprising the same, as well as preparation method and use thereof US Patent  US10329282 Publication Date 6/25/2019 
Target
Name:
Rho-associated protein kinase 2 [1-119]
Synonyms:
KIAA0619 ROCK2 (aa 1-119) Rho-associated protein kinase 2 (ROCK2)
Type:
Enzyme Catalytic Domain
Mol. Mass.:
13160.63
Organism:
Homo sapiens (Human)
Description:
O75116[1-119]
Residue:
119
  
Inhibitor
Name:
BDBM399187
Synonyms:
US10323023, Compound TDI01251 | US11390609, Compound TDI01251
Type:
Small organic molecule
Emp. Form.:
C25H19N9O
Mol. Mass.:
461.4781
SMILES:
Cc1cc(Nc2ccc3[nH]ncc3c2)nc(n1)-c1ccc2cc([nH]c2c1)C(=O)Nc1ccnnc1
: