Target
Rho-associated protein kinase 2 [1-119]
Ligand
BDBM402399
Substrate
Meas. Tech.
Biological Assay
IC50
264±n/a nM
Citation
 Zhao, YWang, HLi, GJiang, YLi, XZhou, LLiu, Y Rho-associated protein kinase inhibitor, pharmaceutical composition comprising the same, as well as preparation method and use thereof US Patent  US10329282 Publication Date 6/25/2019 
Target
Name:
Rho-associated protein kinase 2 [1-119]
Synonyms:
KIAA0619 ROCK2 (aa 1-119) Rho-associated protein kinase 2 (ROCK2)
Type:
Enzyme Catalytic Domain
Mol. Mass.:
13160.63
Organism:
Homo sapiens (Human)
Description:
O75116[1-119]
Residue:
119
  
Inhibitor
Name:
BDBM402399
Synonyms:
US10329282, Compound TDI01423 | US11390609, Compound TDI01423
Type:
Small organic molecule
Emp. Form.:
C28H23N7O2S
Mol. Mass.:
521.593
SMILES:
O=C(NC1CCOC1)c1cc2ccc(cc2[nH]1)-c1nc(Nc2ccc(cc2)-c2cn[nH]c2)c2sccc2n1
: