Target
Beta-secretase 1
Ligand
BDBM402420
Substrate
Meas. Tech.
BACE-1 Ki Assay (BACE-1 HTRF FRET Assay)
Ki
16.0±n/a nM
Citation
 Scott, JDBlizzard, TAWalsh, SPCumming, JN C5-C6-carbocyclic fused iminothiadiazine dioxides as BACE inhibitors, compositions, and their use US Patent  US10329291 Publication Date 6/25/2019 
Target
Name:
Beta-secretase 1
Synonyms:
ASP2 Aspartyl protease 2 BACE1 Beta-secretase (BACE) Beta-secretase 1 (BACE 1) Beta-secretase 1 (BACE1) Beta-site amyloid precursor protein cleaving enzyme 1 Memapsin-2 beta-Secretase (BACE-1) | beta-Secretase (BACE1)
Type:
Protein
Mol. Mass.:
55755.10
Organism:
Homo sapiens (Human)
Description:
P56817
Residue:
501
  
Inhibitor
Name:
BDBM402420
Synonyms:
US10329291, Example 11
Type:
Small organic molecule
Emp. Form.:
C21H24FN5O4S
Mol. Mass.:
461.51
SMILES:
COc1cnc(C(=O)Nc2ccc(F)c(c2)[C@]23CCC[C@H]2S(=O)(=O)N(C)C(=N)N3)c(C)c1
: