Target
Beta-secretase 2
Ligand
BDBM402420
Substrate
Meas. Tech.
BACE-2 Assay
Ki
1.000±n/a nM
Citation
 Scott, JDBlizzard, TAWalsh, SPCumming, JN C5-C6-carbocyclic fused iminothiadiazine dioxides as BACE inhibitors, compositions, and their use US Patent  US10329291 Publication Date 6/25/2019 
Target
Name:
Beta-secretase 2
Synonyms:
AEPLC ASP1 Asp 1 Aspartyl protease 1 BACE2_HUMAN Beta-secretase (BACE) Beta-secretase 2 (BACE-2) Beta-site APP-cleaving enzyme 2 Memapsin-1 beta-Secretase (BACE-2)
Type:
Protein
Mol. Mass.:
56171.20
Organism:
Homo sapiens (Human)
Description:
Q9Y5Z0
Residue:
518
  
Inhibitor
Name:
BDBM402420
Synonyms:
US10329291, Example 11
Type:
Small organic molecule
Emp. Form.:
C21H24FN5O4S
Mol. Mass.:
461.51
SMILES:
COc1cnc(C(=O)Nc2ccc(F)c(c2)[C@]23CCC[C@H]2S(=O)(=O)N(C)C(=N)N3)c(C)c1
: