Target
Prostaglandin E2 receptor EP3 subtype
Ligand
BDBM35853
Substrate
BDBM35847
Meas. Tech.
Prostanoid EP Receptor Binding Assay
Ki
44±n/a nM
EC50
330±n/a nM
Citation
 Asada, MObitsu, TNagase, TSugimoto, IYamaura, YSato, KNarita, MOhuchida, SNakai, HToda, M Discovery of a series of acrylic acids and their derivatives as chemical leads for selective EP3 receptor antagonists. Bioorg Med Chem 17:6567-82 (2009)  
Target
Name:
Prostaglandin E2 receptor EP3 subtype
Synonyms:
PE2R3_MOUSE Prostaglandin E2 receptor EP3 isoform alpha Prostanoid EP3 receptor Ptgerep3
Type:
G-protein coupled receptor
Mol. Mass.:
40092.50
Organism:
Mus musculus (Mouse)
Description:
Residue:
365
  
Inhibitor
Name:
BDBM35853
Synonyms:
acrylic acid derivative, 11
Type:
Small organic molecule
Emp. Form.:
C23H20N2O4
Mol. Mass.:
388.4159
SMILES:
OC(=O)\C=C\c1ccc(Cn2ccnc2)cc1OCCc1cc2ccccc2o1
:
Substrate
Name:
BDBM35847
Synonyms:
(15S)-prostaglandin E2 (5Z,13E,15S)-11alpha,15-dihydroxy-9-oxoprosta-5,13-dien-1-oic acid CHEMBL548 PGE2 [3H]PGE2 prostaglandin E2
Type:
radiolabeled ligand
Emp. Form.:
C20H32O5
Mol. Mass.:
352.4651
SMILES:
CCCCC[C@H](O)\C=C\[C@H]1[C@H](O)CC(=O)[C@@H]1C\C=C/CCCC(O)=O
: