Target
Interleukin-1 receptor-associated kinase 4
Ligand
BDBM402723
Substrate
Meas. Tech.
IRAK4 Kinase Assay
IC50
3.00±n/a nM
Citation
 Lim, JAltman, MDBrubaker, JDGibeau, CR Pyrrolotriazine inhibitors of IRAK4 activity US Patent  US10329295 Publication Date 6/25/2019 
Target
Name:
Interleukin-1 receptor-associated kinase 4
Synonyms:
IRAK-4 IRAK4_HUMAN Interleukin-1 receptor-associated kinase 4 (IRAK4) | Renal carcinoma antigen NY-REN-64
Type:
Protein
Mol. Mass.:
51519.08
Organism:
Homo sapiens (Human)
Description:
Q9NWZ3
Residue:
460
  
Inhibitor
Name:
BDBM402723
Synonyms:
2-{[(1R,2S)-2- aminocyclohexyl]amino}- N-(2-chlorothiophen-3- yl)pyrrolo[2,1- f][1,2,4]triazine-7- carboxamide trifluoroacetate | US10329295, Example 30
Type:
Small organic molecule
Emp. Form.:
C17H19ClN6OS
Mol. Mass.:
390.89
SMILES:
N[C@H]1CCCC[C@H]1Nc1ncc2ccc(C(=O)Nc3ccsc3Cl)n2n1
: