Target
Interleukin-1 receptor-associated kinase 4
Ligand
BDBM402726
Substrate
Meas. Tech.
IRAK4 Kinase Assay
IC50
5347±n/a nM
Citation
 Lim, JAltman, MDBrubaker, JDGibeau, CR Pyrrolotriazine inhibitors of IRAK4 activity US Patent  US10329295 Publication Date 6/25/2019 
Target
Name:
Interleukin-1 receptor-associated kinase 4
Synonyms:
IRAK-4 IRAK4_HUMAN Interleukin-1 receptor-associated kinase 4 (IRAK4) | Renal carcinoma antigen NY-REN-64
Type:
Protein
Mol. Mass.:
51519.08
Organism:
Homo sapiens (Human)
Description:
Q9NWZ3
Residue:
460
  
Inhibitor
Name:
BDBM402726
Synonyms:
N-(2-bromophenyl)-2- (1,4-diazepan-1- yl)pyrrolo[2,1- f][1,2,4]triazine-7- carboxamide trifluoroacetate | US10329295, Example 33
Type:
Small organic molecule
Emp. Form.:
C18H19BrN6O
Mol. Mass.:
415.287
SMILES:
Brc1ccccc1NC(=O)c1ccc2cnc(nn12)N1CCCNCC1
: