Target
Interleukin-1 receptor-associated kinase 4
Ligand
BDBM402744
Substrate
Meas. Tech.
IRAK4 Kinase Assay
IC50
157±n/a nM
Citation
 Lim, JAltman, MDBrubaker, JDGibeau, CR Pyrrolotriazine inhibitors of IRAK4 activity US Patent  US10329295 Publication Date 6/25/2019 
Target
Name:
Interleukin-1 receptor-associated kinase 4
Synonyms:
IRAK-4 IRAK4_HUMAN Interleukin-1 receptor-associated kinase 4 (IRAK4) | Renal carcinoma antigen NY-REN-64
Type:
Protein
Mol. Mass.:
51519.08
Organism:
Homo sapiens (Human)
Description:
Q9NWZ3
Residue:
460
  
Inhibitor
Name:
BDBM402744
Synonyms:
2-[(3R)-3-aminopiperidin- 1-yl]-N-(2- cyanophenyl)pyrrolo[2,1- f][1,2,4]triazine-7- carboxamide trifluoroacetate | US10329295, Example 51
Type:
Small organic molecule
Emp. Form.:
C19H19N7O
Mol. Mass.:
361.4005
SMILES:
N[C@@H]1CCCN(C1)c1ncc2ccc(C(=O)Nc3ccccc3C#N)n2n1
: