Target
Interleukin-1 receptor-associated kinase 4
Ligand
BDBM402810
Substrate
Meas. Tech.
IRAK4 Kinase Assay
IC50
20.0±n/a nM
Citation
 Lim, JAltman, MDBrubaker, JDGibeau, CR Pyrrolotriazine inhibitors of IRAK4 activity US Patent  US10329295 Publication Date 6/25/2019 
Target
Name:
Interleukin-1 receptor-associated kinase 4
Synonyms:
IRAK-4 IRAK4_HUMAN Interleukin-1 receptor-associated kinase 4 (IRAK4) | Renal carcinoma antigen NY-REN-64
Type:
Protein
Mol. Mass.:
51519.08
Organism:
Homo sapiens (Human)
Description:
Q9NWZ3
Residue:
460
  
Inhibitor
Name:
BDBM402810
Synonyms:
N-(3-cyano-1-methyl-1H- pyrazol-4-yl)-2-{[(1R,2S)- 2- hydroxycyclohexyl]amino}- pyrrolo[2,1- f][1,2,4]triazine-7- carboxamide trifluoroacetate | US10329295, Example 122
Type:
Small organic molecule
Emp. Form.:
C18H20N8O2
Mol. Mass.:
380.4038
SMILES:
Cn1cc(NC(=O)c2ccc3cnc(N[C@@H]4CCCC[C@@H]4O)nn23)c(n1)C#N
: