Target
Phosphatidylinositol 4,5-bisphosphate 3-kinase catalytic subunit gamma isoform
Ligand
BDBM342489
Substrate
Meas. Tech.
PI3-Kinase HTRF Assay
IC50
2000±n/a nM
Citation
 Castro, ACEvans, CAJanardanannair, SLescarbeau, ALiu, TTremblay, MR Heterocyclic compounds and uses thereof US Patent  US10329299 Publication Date 6/25/2019 
Target
Name:
Phosphatidylinositol 4,5-bisphosphate 3-kinase catalytic subunit gamma isoform
Synonyms:
PI3-kinase p110 subunit gamma PI3Kgamma PK3CG_HUMAN Phosphatidylinositol 4,5-bisphosphate 3-kinase (PI3K) Phosphatidylinositol 4,5-bisphosphate 3-kinase catalytic subunit gamma (PI3Kgamma) Phosphatidylinositol 4,5-bisphosphate 3-kinase catalytic subunit gamma isoform (PI3K) Phosphatidylinositol-4,5-bisphosphate 3-kinase catalytic subunit gamma isoform Phosphoinositide 3-kinases gamma (PI3K gamma) p120-PI3K
Type:
Enzyme Subunit
Mol. Mass.:
126470.30
Organism:
Homo sapiens (Human)
Description:
P48736
Residue:
1102
  
Inhibitor
Name:
BDBM342489
Synonyms:
US10329299, Compound 56 US11541059, Compound 56 | US9775844, Compound 56
Type:
Small organic molecule
Emp. Form.:
C32H32N8O2
Mol. Mass.:
560.6489
SMILES:
C[C@H](NC(=O)c1c(N)nn2cccnc12)c1cc2cccc(C#CCN3CCN(C)CC3)c2c(=O)n1-c1ccccc1
: