Target
Dimer of Gag-Pol polyprotein [489-587]
Ligand
BDBM888
Substrate
HIV-1 Peptide Substrate
Meas. Tech.
Protease Inhibition Assay
pH
5.5±n/a
Temperature
303.15±n/a K
IC50
0.2±n/a nM
Citation
 Thompson, WJFitzgerald, PMHolloway, MKEmini, EADarke, PLMcKeever, BMSchleif, WAQuintero, JCZugay, JATucker, TJ Synthesis and antiviral activity of a series of HIV-1 protease inhibitors with functionality tethered to the P1 or P1' phenyl substituents: X-ray crystal structure assisted design. J Med Chem 35:1685-701 (1992)  
Target
Name:
Dimer of Gag-Pol polyprotein [489-587]
Synonyms:
HIV-1 Protease
Type:
Protein Complex
Mol. Mass.:
Description:
Components:
This complex has 2 components.
Component 1
Name:
Gag-Pol polyprotein [489-587]
Synonyms:
HIV protease HIV-1 Protease chain A POL_HV1N5 | gag-pol
Type:
Enzyme Subunit
Mol. Mass.:
10822.21
Organism:
Human immunodeficiency virus type 1
Description:
P12497[489-587]
Residue:
99
  
Component 2
Name:
Gag-Pol polyprotein [489-587]
Synonyms:
HIV protease HIV-1 Protease chain A POL_HV1N5 | gag-pol
Type:
Enzyme Subunit
Mol. Mass.:
10822.21
Organism:
Human immunodeficiency virus type 1
Description:
P12497[489-587]
Residue:
99
  
Inhibitor
Name:
BDBM888
Synonyms:
L-685,434 deriv. 36 tert-butyl N-[(2S,3S,5R)-3-hydroxy-5-{[(1S,2R)-2-hydroxy-2,3-dihydro-1H-inden-1-yl]carbamoyl}-5-({4-[2-(4-methylpiperazin-1-yl)ethoxy]phenyl}methyl)-1-phenylpentan-2-yl]carbamate
Type:
Small organic molecule
Emp. Form.:
C40H54N4O6
Mol. Mass.:
686.88
SMILES:
CN1CCN(CCOc2ccc(C[C@H](C[C@H](O)[C@H](Cc3ccccc3)NC(=O)OC(C)(C)C)C(=O)N[C@@H]3[C@H](O)Cc4ccccc34)cc2)CC1
:
Substrate
Name:
HIV-1 Peptide Substrate
Synonyms:
Type:
Peptide
Mol. Mass.:
4333.31
Organism:
Description:
Residue:
40