Target
Androgen receptor
Ligand
BDBM35918
Substrate
SRC2-3 peptide
Meas. Tech.
SPA Binding Assay (IC50)
EC50
83000±n/a nM
Citation
 Féau, CArnold, LAKosinski, AZhu, FConnelly, MGuy, RK Novel flufenamic acid analogues as inhibitors of androgen receptor mediated transcription. ACS Chem Biol 4:834-43 (2009)  
Target
Name:
Androgen receptor
Synonyms:
ANDR_HUMAN Androgen Receptor Androgen receptor/Baculoviral IAP repeat-containing protein 2 Dihydrotestosterone receptor Nuclear receptor subfamily 3 group C member 4
Type:
Receptor
Mol. Mass.:
99185.27
Organism:
Homo sapiens (Human)
Description:
CHO cells were stably transfected with human AR gene.
Residue:
920
  
Inhibitor
Name:
BDBM35918
Synonyms:
flufenamic acid analogue, 44
Type:
Small organic molecule
Emp. Form.:
C21H16F3NO4
Mol. Mass.:
403.3512
SMILES:
COc1ccccc1Oc1ccc(Nc2ccccc2C(O)=O)cc1C(F)(F)F
:
Substrate
Name:
Nuclear receptor coactivator 2 [740-753]
Synonyms:
BHLHE75 NCOA2 Nuclear receptor coactivator 2 (aa 740-753) SRC2-3 peptide | TIF2
Type:
fluorescent labeled peptide
Mol. Mass.:
1704.90
Organism:
Description:
Q15596 aa 740-753
Residue:
14
KENALLRYLLDKDD