Target
5-hydroxytryptamine receptor 2A
Ligand
BDBM35931
Substrate
BDBM21395
Meas. Tech.
Radioligand Binding Assay
pH
7.4±n/a
Temperature
296.15±n/a K
Ki
7356±n/a nM
Citation
 Shah, JRMosier, PDRoth, BLKellogg, GEWestkaemper, RB Synthesis, structure-affinity relationships, and modeling of AMDA analogs at 5-HT2A and H1 receptors: structural factors contributing to selectivity. Bioorg Med Chem 17:6496-504 (2009)  
Target
Name:
5-hydroxytryptamine receptor 2A
Synonyms:
5-HT-2 5-HT2A 5-hydroxytryptamine receptor 2A (5HT-2A) 5HT2A_HUMAN HTR2A | Serotonin receptor 2A
Type:
undefined
Mol. Mass.:
52607.65
Organism:
Homo sapiens (Human)
Description:
P28223
Residue:
471
  
Inhibitor
Name:
BDBM35931
Synonyms:
2,2-diphenylethyl(dimethyl)amine;hydrochloride | diphenylalkylamine (DPA), 4c
Type:
Small organic molecule
Emp. Form.:
C16H19N
Mol. Mass.:
225.3288
SMILES:
CN(C)CC(c1ccccc1)c1ccccc1
:
Substrate
Name:
BDBM21395
Synonyms:
3-(2-(4-(4-Fluorobenzoyl)piperidinol)ethyl)-2,4(1H,3H)-quinazolinedione CHEMBL1628637 Ketanserin R-41-468 [3H]-Ketanserin
Type:
radiolabeled ligand
Emp. Form.:
C22H22FN3O3
Mol. Mass.:
395.4268
SMILES:
Fc1ccc(cc1)C(=O)C1CCN(CCn2c(=O)[nH]c3ccccc3c2=O)CC1
: