Target
Malignant T-cell-amplified sequence 1
Ligand
BDBM403247
Substrate
Meas. Tech.
MTT assay
EC50
5500±n/a nM
Citation
 Bannister, TDRoush, WRChoi, JYNair, RTsai, ASMishra, JKCleveland, JL Heterocyclic inhibitors of monocarboxylate transporter US Patent  US10329303 Publication Date 6/25/2019 
Target
Name:
Malignant T-cell-amplified sequence 1
Synonyms:
MCT-1 MCTS1 Multiple copies T-cell malignancies
Type:
Enzyme Catalytic Domain
Mol. Mass.:
20563.62
Organism:
Homo sapiens (human)
Description:
Residue:
181
  
Inhibitor
Name:
BDBM403247
Synonyms:
US10329303, Example 46
Type:
Small organic molecule
Emp. Form.:
C28H27ClN4O2
Mol. Mass.:
486.993
SMILES:
CC(C)Cc1nn(C)c(=O)c2c(-c3cccc(CO)c3)n(Cc3cc(Cl)nc4ccccc34)cc12
: