Target
PRKC apoptosis WT1 regulator protein
Ligand
BDBM403263
Substrate
Meas. Tech.
FLIPR Assay in PAR4-Expressing HEK293 Cells
IC50
390±n/a nM
Citation
 Martel, ATremblay, F Heterocyclic compounds as inhibitors of platelet aggregation US Patent  US10329307 Publication Date 6/25/2019 
Target
Name:
PRKC apoptosis WT1 regulator protein
Synonyms:
PAR4 PAWR_HUMAN Prostate apoptosis response 4 protein
Type:
Enzyme Catalytic Domain
Mol. Mass.:
36562.04
Organism:
Homo sapiens (Human)
Description:
Residue:
340
  
Inhibitor
Name:
BDBM403263
Synonyms:
US10329307, Example 10
Type:
Small organic molecule
Emp. Form.:
C26H26N4O5S
Mol. Mass.:
506.573
SMILES:
COc1nn2cc(nc2s1)-c1cc2c(OC[C@H]3CCCN3c3ccc(OC)cc3)cc(OC)cc2o1
: