Target
PRKC apoptosis WT1 regulator protein
Ligand
BDBM403303
Substrate
Meas. Tech.
FLIPR Assay in PAR4-Expressing HEK293 Cells
IC50
4800±n/a nM
Citation
 Martel, ATremblay, F Heterocyclic compounds as inhibitors of platelet aggregation US Patent  US10329307 Publication Date 6/25/2019 
Target
Name:
PRKC apoptosis WT1 regulator protein
Synonyms:
PAR4 PAWR_HUMAN Prostate apoptosis response 4 protein
Type:
Enzyme Catalytic Domain
Mol. Mass.:
36562.04
Organism:
Homo sapiens (Human)
Description:
Residue:
340
  
Inhibitor
Name:
BDBM403303
Synonyms:
US10329307, Example 50
Type:
Small organic molecule
Emp. Form.:
C26H25FN4O4S
Mol. Mass.:
508.565
SMILES:
COc1nn2cc(nc2s1)-c1cc2c(OCC3CCN(CC3)c3ccc(F)cc3)cc(OC)cc2o1
: