Target
DNA polymerase III subunit tau
Ligand
BDBM36316
Substrate
BDBM50118233
Meas. Tech.
colorimetric ATPase assay
pH
7.5±0
Temperature
310.15±0 K
Ki
9.0e+3± 3.2e+3 nM
Citation
 Eng, KScouten-Ponticelli, SKSutton, MBerdis, A Selective Inhibition of DNA Replicase Assembly by a Non-natural Nucleotide: Exploiting the Structural Diversity of ATP-Binding Sites ACS Chem Biol 5:183-94 (2010)  
Target
Name:
DNA polymerase III subunit tau
Synonyms:
ATP-dependent clamp loader gamma -complex DPO3X_ECOLI dnaZ | dnaZX
Type:
PROTEIN
Mol. Mass.:
71139.93
Organism:
Escherichia coli
Description:
P06710
Residue:
643
  
Inhibitor
Name:
BDBM36316
Synonyms:
5-ethyl-indolyl- 2'-deoxyriboside triphosphate | d5-EtITP
Type:
Small organic molecule
Emp. Form.:
C15H22NO12P3
Mol. Mass.:
501.256
SMILES:
[H][C@]1(O)C[C@@]([H])(O[C@]1([H])COP(O)(=O)OP(O)(=O)OP(O)(O)=O)n1ccc2cc(CC)ccc12
:
Substrate
Name:
BDBM50118233
Synonyms:
2'-deoxyadenosine 5'-(tetrahydrogen triphosphate) CHEMBL335538 | dATP
Type:
Small organic molecule
Emp. Form.:
C10H16N5O12P3
Mol. Mass.:
491.1816
SMILES:
Nc1ncnc2n(cnc12)[C@H]1C[C@H](O)[C@@H](COP(O)(=O)OP(O)(=O)OP(O)(O)=O)O1
: