Target
Complex of Sliding-clamp-loader large subunit [R175L] and Sliding-clamp-loader small subunit
Ligand
BDBM36318
Substrate
BDBM50118233
Meas. Tech.
colorimetric ATPase assay
pH
7.5±0
Temperature
298.15±0 K
Ki
<2.00e+5±n/a nM
Citation
 Eng, KScouten-Ponticelli, SKSutton, MBerdis, A Selective Inhibition of DNA Replicase Assembly by a Non-natural Nucleotide: Exploiting the Structural Diversity of ATP-Binding Sites ACS Chem Biol 5:183-94 (2010)  
Target
Name:
Complex of Sliding-clamp-loader large subunit [R175L] and Sliding-clamp-loader small subunit
Synonyms:
ATP-dependent clamp loaders gp44/62 (R175L)
Type:
PROTEIN
Mol. Mass.:
57093.31
Organism:
bacteriophage T4
Description:
Modified from ATP-dependent clamp loaders 44/62
Residue:
506
  
Inhibitor
Name:
BDBM36318
Synonyms:
5-carboxylate-indolyl- 2'-deoxyriboside triphosphate d5-CITP
Type:
Small organic molecule
Emp. Form.:
C14H18NO14P3
Mol. Mass.:
517.2123
SMILES:
[H][C@]1(O)C[C@@]([H])(O[C@]1([H])COP(O)(=O)OP(O)(=O)OP(O)(O)=O)n1ccc2cc(ccc12)C(O)=O
:
Substrate
Name:
BDBM50118233
Synonyms:
2'-deoxyadenosine 5'-(tetrahydrogen triphosphate) CHEMBL335538 | dATP
Type:
Small organic molecule
Emp. Form.:
C10H16N5O12P3
Mol. Mass.:
491.1816
SMILES:
Nc1ncnc2n(cnc12)[C@H]1C[C@H](O)[C@@H](COP(O)(=O)OP(O)(=O)OP(O)(O)=O)O1
: