Target
Pro-cathepsin H
Ligand
BDBM36325
Substrate
BDBM36388
Meas. Tech.
Assay name: Protease Inhibition Assay
pH
5.5±0
Temperature
310.15±0 K
IC50
6.6e+3±n/a nM
Citation
 Kato, DBoatright, KMBerger, ABNazif, TBlum, GRyan, CChehade, KASalvesen, GSBogyo, M Activity-based probes that target diverse cysteine protease families. Nat Chem Biol 1:33-8 (2005)  
Target
Name:
Pro-cathepsin H
Synonyms:
CATH_RAT Ctsh
Type:
PROTEIN
Mol. Mass.:
37114.31
Organism:
Rattus norvegicus
Description:
P00786
Residue:
333
  
Inhibitor
Name:
BDBM36325
Synonyms:
Cathepsin Inhibitor III
Type:
Small organic molecule
Emp. Form.:
C27H27N3O7
Mol. Mass.:
505.5192
SMILES:
COc1ccc(cc1)C(=O)ONC(=O)CNC(=O)C(Cc1ccccc1)NC(=O)OCc1ccccc1
:
Substrate
Name:
BDBM36388
Synonyms:
BDBM36404 Octahydro-indolizine-1,6,7,8-tetraol, 13
Type:
Small organic molecule
Emp. Form.:
C8H15NO4
Mol. Mass.:
189.209
SMILES:
O[C@H]1CCN2C[C@H](O)[C@@H](O)[C@H](O)[C@@H]12
: