Target
Cathepsin B
Ligand
BDBM36334
Substrate
Fluorogenic Substrate
Meas. Tech.
Enzyme kinetic assay
pH
6.25±0
Temperature
298.15±0 K
IC50
7.8e+2±n/a nM
Citation
 Lee, JBogyo, M Development of near-infrared fluorophore (NIRF)-labeled activity-based probes for in vivo imaging of legumain. ACS Chem Biol 5:233-43 (2010)  
Target
Name:
Cathepsin B
Synonyms:
CATB_MOUSE | Ctsb
Type:
PROTEIN
Mol. Mass.:
37275.39
Organism:
Mus musculus
Description:
ChEMBL_464363
Residue:
339
  
Inhibitor
Name:
BDBM36334
Synonyms:
CID644294 JPM-OEt | US9345789, JPM-Oet
Type:
Small organic molecule
Emp. Form.:
C20H28N2O6
Mol. Mass.:
392.4461
SMILES:
[H][C@](NC(=O)[C@@]1([H])O[C@]1([H])C(=O)OCC)(C(C)CC)C(=O)NCCc1ccc(O)cc1
:
Substrate
Name:
Fluorogenic Substrate
Synonyms:
Type:
Peptide
Mol. Mass.:
1645.93
Organism:
Description:
Residue:
15
CPHEARGAMCACHEM