Target
Calcium-dependent protein kinase 1
Ligand
BDBM36343
Substrate
MTIP
Meas. Tech.
Scintillation Proximity Assay
pH
7.5±0
Temperature
297.15±0 K
IC50
703±0.0 nM
Citation
 Kato, NSakata, TBreton, GLe Roch, KGNagle, AAndersen, CBursulaya, BHenson, KJohnson, JKumar, KAMarr, FMason, DMcNamara, CPlouffe, DRamachandran, VSpooner, MTuntland, TZhou, YPeters, ECChatterjee, ASchultz, PGWard, GEGray, NHarper, JWinzeler, EA Gene expression signatures and small-molecule compounds link a protein kinase to Plasmodium falciparum motility. Nat Chem Biol 4:347-56 (2008)  
Target
Name:
Calcium-dependent protein kinase 1
Synonyms:
CDPK1 CPK1 PfCDPK1
Type:
PROTEIN
Mol. Mass.:
60804.87
Organism:
Plasmodium Falciparum
Description:
P62343
Residue:
524
  
Inhibitor
Name:
BDBM36343
Synonyms:
CID24762173 | N2-trans-(4-Amino-cyclohexyl)-N6-(4-morpholin-4-ylmethyl-phenyl)-9-phenyl-9H-purine-2,6-diamine, 11
Type:
Small organic molecule
Emp. Form.:
C28H34N8O
Mol. Mass.:
498.6226
SMILES:
N[C@H]1CC[C@@H](CC1)Nc1nc(Nc2ccc(CN3CCOCC3)cc2)c2ncn(-c3ccccc3)c2n1
:
Substrate
Name:
MTIP
Synonyms:
PFL2225w
Type:
Substrate
Mol. Mass.:
23466.36
Organism:
Plasmodium falciparum
Description:
Q8I4W8
Residue:
204