Target
Calcium-dependent protein kinase 1
Ligand
BDBM36345
Substrate
MTIP
Meas. Tech.
Scintillation Proximity Assay
pH
7.5±0
Temperature
297.15±0 K
IC50
430±0.0 nM
Citation
 Kato, NSakata, TBreton, GLe Roch, KGNagle, AAndersen, CBursulaya, BHenson, KJohnson, JKumar, KAMarr, FMason, DMcNamara, CPlouffe, DRamachandran, VSpooner, MTuntland, TZhou, YPeters, ECChatterjee, ASchultz, PGWard, GEGray, NHarper, JWinzeler, EA Gene expression signatures and small-molecule compounds link a protein kinase to Plasmodium falciparum motility. Nat Chem Biol 4:347-56 (2008)  
Target
Name:
Calcium-dependent protein kinase 1
Synonyms:
CDPK1 CPK1 PfCDPK1
Type:
PROTEIN
Mol. Mass.:
60804.87
Organism:
Plasmodium Falciparum
Description:
P62343
Residue:
524
  
Inhibitor
Name:
BDBM36345
Synonyms:
CID24762175 | {4-[2-(3-Morpholin-4-yl-propylamino)-9-phenyl-9H-purin-6-ylamino]-phenyl}-piperidin-1-yl-methanone, 13
Type:
Small organic molecule
Emp. Form.:
C30H36N8O2
Mol. Mass.:
540.6592
SMILES:
O=C(N1CCCCC1)c1ccc(Nc2nc(NCCCN3CCOCC3)nc3n(cnc23)-c2ccccc2)cc1
:
Substrate
Name:
MTIP
Synonyms:
PFL2225w
Type:
Substrate
Mol. Mass.:
23466.36
Organism:
Plasmodium falciparum
Description:
Q8I4W8
Residue:
204