Target
Calcium-dependent protein kinase 1
Ligand
BDBM36349
Substrate
MTIP
Meas. Tech.
Parasite Proliferation Assay
pH
7.5±0
Temperature
297.15±0 K
EC50
28±0 nM
Citation
 Kato, NSakata, TBreton, GLe Roch, KGNagle, AAndersen, CBursulaya, BHenson, KJohnson, JKumar, KAMarr, FMason, DMcNamara, CPlouffe, DRamachandran, VSpooner, MTuntland, TZhou, YPeters, ECChatterjee, ASchultz, PGWard, GEGray, NHarper, JWinzeler, EA Gene expression signatures and small-molecule compounds link a protein kinase to Plasmodium falciparum motility. Nat Chem Biol 4:347-56 (2008)  
Target
Name:
Calcium-dependent protein kinase 1
Synonyms:
CDPK1 CPK1 PfCDPK1
Type:
PROTEIN
Mol. Mass.:
60804.87
Organism:
Plasmodium Falciparum
Description:
P62343
Residue:
524
  
Inhibitor
Name:
BDBM36349
Synonyms:
Artemisinin, 18 | CID452191
Type:
Small organic molecule
Emp. Form.:
C15H22O5
Mol. Mass.:
282.3322
SMILES:
[H][C@@]12CC[C@@H](C)[C@]3([H])CC[C@]4(C)OO[C@@]13[C@]([H])(OC(=O)[C@@H]2C)O4
:
Substrate
Name:
MTIP
Synonyms:
PFL2225w
Type:
Substrate
Mol. Mass.:
23466.36
Organism:
Plasmodium falciparum
Description:
Q8I4W8
Residue:
204