Target
Vascular endothelial growth factor receptor 2
Ligand
BDBM5410
Substrate
poly(Glu4, Tyr)
Meas. Tech.
in vitro Kinase Assay
IC50
161.0±0.0 nM
Citation
 Hao, JHo, JNLewis, JAKarim, KADaniels, RNGentry, PRHopkins, CRLindsley, CWHong, CC In vivo structure-activity relationship study of dorsomorphin analogues identifies selective VEGF and BMP inhibitors. ACS Chem Biol 5:245-53 (2010)  
Target
Name:
Vascular endothelial growth factor receptor 2
Synonyms:
CD_antigen=CD309 Fetal liver kinase 1 (FLK-1) KDR Protein-tyrosine kinase receptor Flk-1 VEGFR-2 VEGFR2 Vascular Endothelial Growth Factor Receptor Kinase 2 Vascular endothelial growth factor receptor 2 (KDR) Vascular endothelial growth factor receptor 2 (VEGFR2) Vascular endothelial growth factor receptor-2 (VEGFR-2)
Type:
Receptor Tyrosine Kinase
Mol. Mass.:
151510.97
Organism:
Homo sapiens (Human)
Description:
P35968
Residue:
1356
  
Inhibitor
Name:
BDBM5410
Synonyms:
4-(2-(4-(3-phenylpyrazolo[1,5- a]pyrimidin-6-yl)phenoxy)ethyl)morpholine US9040694, 4 | pyrazolo[1,5-a]pyrimidine 4b
Type:
Small organic molecule
Emp. Form.:
C24H24N4O2
Mol. Mass.:
400.473
SMILES:
C(CN1CCOCC1)Oc1ccc(cc1)-c1cnc2c(cnn2c1)-c1ccccc1
:
Substrate
Name:
poly(Glu4, Tyr)
Synonyms:
Type:
Random copolymer
Mol. Mass.:
358.43
Organism:
Description:
Residue:
3
NA