Target
Beta-mannosidase
Ligand
BDBM36376
Substrate
BDBM36394
Meas. Tech.
Btman2A
pH
5.6±0
Temperature
310.15±0 K
Ki
401±0.0 nM
Citation
 Tailford, LEOffen, WASmith, NLDumon, CMorland, CGratien, JHeck, MPStick, RVBlériot, YVasella, AGilbert, HJDavies, GJ Structural and biochemical evidence for a boat-like transition state in beta-mannosidases. Nat Chem Biol 4:306-12 (2008)  
Target
Name:
Beta-mannosidase
Synonyms:
Type:
Protien
Mol. Mass.:
99501.54
Organism:
Bacteroides thetaiotaomicron
Description:
Q8AAK6
Residue:
864
  
Inhibitor
Name:
BDBM36376
Synonyms:
(5R,6R,7S,8R)-5,6,7,8-Tetrahydro-5-(hydroxymethyl)-2-(phenoxymethyl)-imidazo[1,2-a]pyridine-6,7,8-triol, 1d | CID11197529
Type:
Small organic molecule
Emp. Form.:
C15H18N2O5
Mol. Mass.:
306.3138
SMILES:
OC[C@@H]1[C@@H](O)[C@H](O)[C@H](O)c2nc(COc3ccccc3)cn12
:
Substrate
Name:
BDBM36394
Synonyms:
2,4-dinitrophenyl-b-D-mannopyranoside, 17 | CID24752825
Type:
Substrate
Emp. Form.:
C12H14N2O10
Mol. Mass.:
346.247
SMILES:
OC[C@H]1O[C@@H](Oc2ccc(cc2[N+]([O-])=O)[N+]([O-])=O)[C@@H](O)[C@@H](O)[C@@H]1O
: