Target
Proto-oncogene tyrosine-protein kinase Src/Serine/threonine-protein kinase mTOR
Ligand
BDBM36409
Substrate
Meas. Tech.
Tyrosine Kinase Assay
IC50
5.1e+3±n/a nM
Citation
 Apsel, BBlair, JAGonzalez, BNazif, TMFeldman, MEAizenstein, BHoffman, RWilliams, RLShokat, KMKnight, ZA Targeted polypharmacology: discovery of dual inhibitors of tyrosine and phosphoinositide kinases. Nat Chem Biol 4:691-9 (2008)  
Target
Name:
Proto-oncogene tyrosine-protein kinase Src/Serine/threonine-protein kinase mTOR
Synonyms:
mTOR/ Src Mutant (T338I)
Type:
Complex
Mol. Mass.:
Description:
Components:
This complex has 2 components.
Component 1
Name:
Serine/threonine-protein kinase mTOR
Synonyms:
FK506-binding protein 12-rapamycin complex-associated protein 1 FRAP FRAP1 MTOR Mammalian Target of Rapamycin (mTOR) RAFT1 Rapamycin and FKBP12 target 1 Serine/threonine-protein kinase (mTOR) | mTORC2
Type:
Rapamycin target protein
Mol. Mass.:
288917.12
Organism:
Homo sapiens (Human)
Description:
P42345
Residue:
2549
  
Component 2
Name:
Proto-oncogene tyrosine-protein kinase Src
Synonyms:
Proto-oncogene c-Src SRC_CHICK c-Src p60c-src | pp60c-src
Type:
Tyr protein kinase
Mol. Mass.:
60015.36
Organism:
Gallus gallus (Chicken)
Description:
P00523
Residue:
533
  
Inhibitor
Name:
BDBM36409
Synonyms:
2-(4-amino-1-isopropyl-1H-pyrazolo[3,4-d]pyrimidin-3-yl)-1H-indol-5-ol, PP242 US10172858, Table 2.1 | US9828378, # 1
Type:
Small organic molecule
Emp. Form.:
C16H16N6O
Mol. Mass.:
308.3378
SMILES:
CC(C)n1nc(-c2cc3cc(O)ccc3[nH]2)c2c(N)ncnc12
: