Target
DNA-dependent protein kinase catalytic subunit/Serine/threonine-protein kinase mTOR
Ligand
BDBM36410
Substrate
Meas. Tech.
PI3K Inhibition Assay
IC50
4.8e+3±n/a nM
Citation
 Apsel, BBlair, JAGonzalez, BNazif, TMFeldman, MEAizenstein, BHoffman, RWilliams, RLShokat, KMKnight, ZA Targeted polypharmacology: discovery of dual inhibitors of tyrosine and phosphoinositide kinases. Nat Chem Biol 4:691-9 (2008)  
Target
Name:
DNA-dependent protein kinase catalytic subunit/Serine/threonine-protein kinase mTOR
Synonyms:
DNA-PK/ mTOR | mTOR/ DNA-PK
Type:
Complex
Mol. Mass.:
Description:
Components:
This complex has 2 components.
Component 1
Name:
Serine/threonine-protein kinase mTOR
Synonyms:
FK506-binding protein 12-rapamycin complex-associated protein 1 FRAP FRAP1 MTOR Mammalian Target of Rapamycin (mTOR) RAFT1 Rapamycin and FKBP12 target 1 Serine/threonine-protein kinase (mTOR) | mTORC2
Type:
Rapamycin target protein
Mol. Mass.:
288917.12
Organism:
Homo sapiens (Human)
Description:
P42345
Residue:
2549
  
Component 2
Name:
DNA-dependent protein kinase catalytic subunit
Synonyms:
DNA-PK catalytic subunit DNA-dependent protein kinase (DNA-PK) DNA-dependent protein kinase catalytic subunit (DNA-PK) HYRC PRKDC | PRKDC_HUMAN
Type:
Protein
Mol. Mass.:
469114.78
Organism:
Homo sapiens (Human)
Description:
P78527
Residue:
4128
  
Inhibitor
Name:
BDBM36410
Synonyms:
1-cyclopentyl-3-(H-imidazo[1,2-a]pyridin-7-yl)-1H-pyrazolo[3,4-d]pyrimidin-4-amine, PP162 | CID24905148
Type:
Small organic molecule
Emp. Form.:
C17H17N7
Mol. Mass.:
319.3638
SMILES:
Nc1ncnc2n(nc(-c3ccn4ccnc4c3)c12)C1CCCC1
: