Target
DNA-dependent protein kinase catalytic subunit/Vascular endothelial growth factor receptor 2
Ligand
BDBM36410
Substrate
Meas. Tech.
Tyrosine Kinase Assay
IC50
>5.0e+4±n/a nM
Citation
 Apsel, BBlair, JAGonzalez, BNazif, TMFeldman, MEAizenstein, BHoffman, RWilliams, RLShokat, KMKnight, ZA Targeted polypharmacology: discovery of dual inhibitors of tyrosine and phosphoinositide kinases. Nat Chem Biol 4:691-9 (2008)  
Target
Name:
DNA-dependent protein kinase catalytic subunit/Vascular endothelial growth factor receptor 2
Synonyms:
DNA-PK/ VEGFR2
Type:
Complex
Mol. Mass.:
Description:
Components:
This complex has 2 components.
Component 1
Name:
DNA-dependent protein kinase catalytic subunit
Synonyms:
DNA-PK catalytic subunit DNA-dependent protein kinase (DNA-PK) DNA-dependent protein kinase catalytic subunit (DNA-PK) HYRC PRKDC | PRKDC_HUMAN
Type:
Protein
Mol. Mass.:
469114.78
Organism:
Homo sapiens (Human)
Description:
P78527
Residue:
4128
  
Component 2
Name:
Vascular endothelial growth factor receptor 2
Synonyms:
CD_antigen=CD309 Fetal liver kinase 1 (FLK-1) KDR Protein-tyrosine kinase receptor Flk-1 VEGFR-2 VEGFR2 Vascular Endothelial Growth Factor Receptor Kinase 2 Vascular endothelial growth factor receptor 2 (KDR) Vascular endothelial growth factor receptor 2 (VEGFR2) Vascular endothelial growth factor receptor-2 (VEGFR-2)
Type:
Receptor Tyrosine Kinase
Mol. Mass.:
151510.97
Organism:
Homo sapiens (Human)
Description:
P35968
Residue:
1356
  
Inhibitor
Name:
BDBM36410
Synonyms:
1-cyclopentyl-3-(H-imidazo[1,2-a]pyridin-7-yl)-1H-pyrazolo[3,4-d]pyrimidin-4-amine, PP162 | CID24905148
Type:
Small organic molecule
Emp. Form.:
C17H17N7
Mol. Mass.:
319.3638
SMILES:
Nc1ncnc2n(nc(-c3ccn4ccnc4c3)c12)C1CCCC1
: