Target
Phosphatidylinositol 4,5-bisphosphate 3-kinase catalytic subunit delta isoform/Platelet-derived growth factor receptor beta [525-1106]
Ligand
BDBM36411
Substrate
Meas. Tech.
Tyrosine Kinase Assay
IC50
>5.0e+4±n/a nM
Citation
 Apsel, BBlair, JAGonzalez, BNazif, TMFeldman, MEAizenstein, BHoffman, RWilliams, RLShokat, KMKnight, ZA Targeted polypharmacology: discovery of dual inhibitors of tyrosine and phosphoinositide kinases. Nat Chem Biol 4:691-9 (2008)  
Target
Name:
Phosphatidylinositol 4,5-bisphosphate 3-kinase catalytic subunit delta isoform/Platelet-derived growth factor receptor beta [525-1106]
Synonyms:
p110-delta/ PDGFR
Type:
Complex
Mol. Mass.:
Description:
Components:
This complex has 2 components.
Component 1
Name:
Phosphatidylinositol 4,5-bisphosphate 3-kinase catalytic subunit delta isoform
Synonyms:
PI3-kinase p110 subunit delta PI3-kinase subunit p110-delta PIK3CD Phosphatidylinositol 4,5-biphosphate 3-kinase catalytic subunit delta (PIK3CD) Phosphatidylinositol 4,5-bisphosphate 3-kinase 110 kDa catalytic subunit delta (PI3K delta) Phosphatidylinositol 4,5-bisphosphate 3-kinase catalytic subunit delta (PI3Kdelta) Phosphatidylinositol 4,5-bisphosphate 3-kinase catalytic subunit delta isoform (PI3K delta) Phosphatidylinositol 4,5-bisphosphate 3-kinase catalytic subunit delta isoform (PI3K-delta) Phosphatidylinositol 4,5-bisphosphate 3-kinase catalytic subunit delta isoform (PI3Kdelta)
Type:
Enzyme Subunit
Mol. Mass.:
119489.41
Organism:
Homo sapiens (Human)
Description:
O00329
Residue:
1044
  
Component 2
Name:
Platelet-derived growth factor receptor beta [525-1106]
Synonyms:
PDGFR PDGFR1 PGFRB_HUMAN
Type:
Protein
Mol. Mass.:
65194.01
Organism:
Homo sapiens (Human)
Description:
P09619[525-1106] modified
Residue:
582
  
Inhibitor
Name:
BDBM36411
Synonyms:
2-((4-amino-3-(3-hydroxyphenyl)-1H-pyrazolo[3,4-d]pyrimidin-1-yl)methyl)-5-methyl-3-o-tolylquinazolin-4(3H)-one, PIK294 PIK294
Type:
Small organic molecule
Emp. Form.:
C28H23N7O2
Mol. Mass.:
489.5279
SMILES:
Cc1ccccc1-n1c(Cn2nc(-c3cccc(O)c3)c3c(N)ncnc23)nc2cccc(C)c2c1=O
: