Target
Phospholipase D1
Ligand
BDBM87245
Substrate
Meas. Tech.
PLD1 In Vitro Enzymatic Assay
Temperature
310.15±0 K
IC50
81±0.0 nM
Citation
 Scott, SASelvy, PEBuck, JRCho, HPCriswell, TLThomas, ALArmstrong, MDArteaga, CLLindsley, CWBrown, HA Design of isoform-selective phospholipase D inhibitors that modulate cancer cell invasiveness. Nat Chem Biol 5:108-17 (2009)  
Target
Name:
Phospholipase D1
Synonyms:
Choline phosphatase 1 PLD1 Phosphatidylcholine-hydrolyzing phospholipase D1 Phospholipase D1 Phospholipase D2 (PLD2) | hPLD1
Type:
Protein
Mol. Mass.:
124219.92
Organism:
Homo sapiens (Human)
Description:
Q13393
Residue:
1074
  
Inhibitor
Name:
BDBM87245
Synonyms:
CHEMBL492797 N-(2-(4-(2-Oxo-2,3-dihydro-1H-benzo[d]imidazol-1-yl)piperidin-1-yl)ethyl)-2-naphthamide, 56 N-[2-[4-(2-keto-3H-benzimidazol-1-yl)piperidino]ethyl]-2-naphthamide;hydrochloride N-[2-[4-(2-oxo-3H-benzimidazol-1-yl)-1-piperidinyl]ethyl]-2-naphthalenecarboxamide;hydrochloride US9453017, 3 VU0156056 (1) | cid_53481919
Type:
Small organic molecule
Emp. Form.:
C25H26N4O2
Mol. Mass.:
414.4995
SMILES:
O=C(NCCN1CCC(CC1)n1c2ccccc2[nH]c1=O)c1ccc2ccccc2c1
: