Target
Estrogen receptor
Ligand
BDBM263668
Substrate
Meas. Tech.
Estrogen Receptor Coactivator Assay
pH
7.4±n/a
Temperature
298.15±n/a K
IC50
7.00±n/a nM
Comments
extracted
Citation
 Bouaboula, MBrollo, MCertal, VEl-Ahmad, YFiloche-Romme, BHalley, FMcCort, GSchio, LTabart, MTerrier, CThompson, F Substituted 6,7-dihydro-5H-benzo[7]annulene compounds, processes for their preparation and therapeutic uses thereof US Patent  US9714221 Publication Date 7/25/2017 
Target
Name:
Estrogen receptor
Synonyms:
ER ESR ESR1_HUMAN Estrogen receptor Estrogen receptor (ER-alpha) Estrogen receptor alpha (ER) Nuclear receptor subfamily 3 group A member 1
Type:
Protein
Mol. Mass.:
66230.44
Organism:
Homo sapiens (Human)
Description:
P03372
Residue:
595
  
Inhibitor
Name:
BDBM263668
Synonyms:
6-(2- chloro-4- fluoro- phenyl)-5- [4-[(3S)-1- (3-fluoro- propyl)- pyrrolidin-3- yl]oxy- phenyl]-8,9- dihydro- 7H- benzo[7]- annulen-2-ol | US9714221, Example 5
Type:
Small organic molecule
Emp. Form.:
C30H30ClF2NO2
Mol. Mass.:
510.015
SMILES:
Oc1ccc2c(CCCC(c3ccc(F)cc3Cl)=C2c2ccc(O[C@H]3CCN(CCCF)C3)cc2)c1
: