Target
Estrogen receptor [D538G]
Ligand
BDBM263707
Substrate
Meas. Tech.
Estrogen Receptor Coactivator Assay
pH
7.4±n/a
Temperature
298.15±n/a K
IC50
16.0±n/a nM
Comments
extracted
Citation
 Bouaboula, MBrollo, MCertal, VEl-Ahmad, YFiloche-Romme, BHalley, FMcCort, GSchio, LTabart, MTerrier, CThompson, F Substituted 6,7-dihydro-5H-benzo[7]annulene compounds, processes for their preparation and therapeutic uses thereof US Patent  US9714221 Publication Date 7/25/2017 
Target
Name:
Estrogen receptor [D538G]
Synonyms:
ESR ESR1_HUMAN NR3A1
Type:
Enzyme Catalytic Domain
Mol. Mass.:
66173.42
Organism:
Homo sapiens (Human)
Description:
P03372[D538G]
Residue:
595
  
Inhibitor
Name:
BDBM263707
Synonyms:
5-[4-[(3S)- 1-(3- fluoropropyl)- pyrrolidin-3- yl]oxy- phenyl]-6-(4- methoxy- 2-methyl- phenyl)-8,9- dihydro- 7H- benzo[7]- annulen-2-ol1-fluoro-6- (2-fluoro-4- methyl- phenyl)-5- [4-[(3S)-1- (3- fluoropropyl)- pyrrolidin-3- yl]oxy- phenyl]-8,9- dihydro- 7H- benzo[7]- annulen-2-ol | US9714221, Example 44
Type:
Small organic molecule
Emp. Form.:
C32H36FNO3
Mol. Mass.:
501.6315
SMILES:
COc1ccc(c(C)c1)C1=C(c2ccc(O[C@H]3CCN(CCCF)C3)cc2)c2ccc(O)cc2CCC1
: