Target
Estrogen receptor [D538G]
Ligand
BDBM263712
Substrate
Meas. Tech.
Estrogen Receptor Coactivator Assay
pH
7.4±n/a
Temperature
298.15±n/a K
IC50
11.0±n/a nM
Comments
extracted
Citation
 Bouaboula, MBrollo, MCertal, VEl-Ahmad, YFiloche-Romme, BHalley, FMcCort, GSchio, LTabart, MTerrier, CThompson, F Substituted 6,7-dihydro-5H-benzo[7]annulene compounds, processes for their preparation and therapeutic uses thereof US Patent  US9714221 Publication Date 7/25/2017 
Target
Name:
Estrogen receptor [D538G]
Synonyms:
ESR ESR1_HUMAN NR3A1
Type:
Enzyme Catalytic Domain
Mol. Mass.:
66173.42
Organism:
Homo sapiens (Human)
Description:
P03372[D538G]
Residue:
595
  
Inhibitor
Name:
BDBM263712
Synonyms:
6-(2,3- dihydro- 1,4- benzodioxin-6-yl)-5- [4-[(3S)-1-(3- fluoropropyl)- pyrrolidin-3- yl]oxy- phenyl]-8,9- dihydro- 7H- benzo[7]- annulen-2-ol | US9714221, Example 49
Type:
Small organic molecule
Emp. Form.:
C32H34FNO4
Mol. Mass.:
515.6151
SMILES:
Oc1ccc2c(CCCC(c3ccc4OCCOc4c3)=C2c2ccc(O[C@H]3CCN(CCCF)C3)cc2)c1
: