Target
Beta-lactamase CTX-M-1
Ligand
BDBM36438
Substrate
Meas. Tech.
Beta-lactamase CTX-M Inhibition Assay
pH
7±0
Ki
4400000±0.0 nM
Citation
 Chen, YShoichet, BK Molecular docking and ligand specificity in fragment-based inhibitor discovery. Nat Chem Biol 5:358-64 (2009)  
Target
Name:
Beta-lactamase CTX-M-1
Synonyms:
BLC1_ECOLX bla men1
Type:
Protien
Mol. Mass.:
31251.38
Organism:
Escherichia coli
Description:
Q7AVW6
Residue:
291
  
Inhibitor
Name:
BDBM36438
Synonyms:
CID25181258 | ZINC04401406, 2
Type:
Small organic molecule
Emp. Form.:
C7H8N5O
Mol. Mass.:
178.1719
SMILES:
O=C1CCCC(Nc2nn[n-]n2)=C1
: