Target
Beta-lactamase CTX-M-1
Ligand
BDBM36448
Substrate
Meas. Tech.
Beta-lactamase CTX-M Inhibition Assay
pH
7±0
Ki
21000±0.0 nM
Citation
 Chen, YShoichet, BK Molecular docking and ligand specificity in fragment-based inhibitor discovery. Nat Chem Biol 5:358-64 (2009)  
Target
Name:
Beta-lactamase CTX-M-1
Synonyms:
BLC1_ECOLX bla men1
Type:
Protien
Mol. Mass.:
31251.38
Organism:
Escherichia coli
Description:
Q7AVW6
Residue:
291
  
Inhibitor
Name:
BDBM36448
Synonyms:
CID8067740 | ZINC06742509, 12
Type:
Small organic molecule
Emp. Form.:
C14H9FN5O
Mol. Mass.:
282.2531
SMILES:
Fc1cccc(c1)C(=O)Nc1cccc(c1)-c1nn[n-]n1
: