Target
Mitogen-activated protein kinase 14
Ligand
BDBM50156750
Substrate
Meas. Tech.
MAPK p38 Inhibition Assay
pH
9.5±0
Temperature
289.15±0 K
IC50
18±0.0 nM
Target
Name:
Mitogen-activated protein kinase 14
Synonyms:
CSAID-binding protein CSBP1 CSPB1 MAP kinase 14 MAP kinase p38 alpha MAPK14 MK14_HUMAN Mitogen-activated protein kinase p38 alpha Stress-activated protein kinase 2a | p38 MAP kinase alpha/beta
Type:
Serine/threonine-protein kinase
Mol. Mass.:
41286.76
Organism:
Homo sapiens (Human)
Description:
Q16539
Residue:
360
  
Inhibitor
Name:
BDBM50156750
Synonyms:
CHEMBL376506 N-methoxy-4-methyl-3-(4-(methyl(neopentyl)amino)-6-(piperazin-1-yl)-1,3,5-triazin-2-ylamino)benzamide
Type:
Small organic molecule
Emp. Form.:
C22H34N8O2
Mol. Mass.:
442.5578
SMILES:
CONC(=O)c1ccc(C)c(Nc2nc(nc(n2)N2CCNCC2)N(C)CC(C)(C)C)c1
: