Target
5'-methylthioadenosine/S-adenosylhomocysteine nucleosidase
Ligand
BDBM36494
Substrate
BDBM22111
Meas. Tech.
Enzyme Activity Assay
pH
7.5±0
Temperature
298.15±0 K
Kd
0.120±0.0 nM
Citation
 Gutierrez, JALuo, MSingh, VLi, LBrown, RLNorris, GEEvans, GBFurneaux, RHTyler, PCPainter, GFLenz, DHSchramm, VL Picomolar inhibitors as transition-state probes of 5'-methylthioadenosine nucleosidases. ACS Chem Biol 2:725-34 (2007)  
Target
Name:
5'-methylthioadenosine/S-adenosylhomocysteine nucleosidase
Synonyms:
5'-methylthioadenosine/S-adenosylhomocysteine nucleosidase | Methylthioadenosine Nucleosidase (MTAN)
Type:
Enzyme
Mol. Mass.:
24739.13
Organism:
Neisseria meningitidis
Description:
C6S634
Residue:
233
  
Inhibitor
Name:
BDBM36494
Synonyms:
CHEMBL554965 | ImmA-Et
Type:
Small organic molecule
Emp. Form.:
C13H19N5O2S
Mol. Mass.:
309.387
SMILES:
CCSCC1NC(C(O)C1O)c1c[nH]c2c(N)ncnc12
:
Substrate
Name:
BDBM22111
Synonyms:
(2R,3R,4S,5S)-2-(6-amino-9H-purin-9-yl)-5-[(methylsulfanyl)methyl]oxolane-3,4-diol 5'-Methylthioado CHEMBL277041 | MTA
Type:
Nucleoside or nucleotide
Emp. Form.:
C11H15N5O3S
Mol. Mass.:
297.334
SMILES:
CSC[C@H]1O[C@H]([C@H](O)[C@@H]1O)n1cnc2c(N)ncnc12
: