Target
Tyrosine-protein kinase BTK
Ligand
BDBM36519
Substrate
Meas. Tech.
Btk Kinase Assay
pH
7.5±0
Temperature
296.15±0 K
IC50
9058±328 nM
Citation
 Di Paolo, JAHuang, TBalazs, MBarbosa, JBarck, KHBravo, BJCarano, RADarrow, JDavies, DRDeForge, LEDiehl, LFerrando, RGallion, SLGiannetti, AMGribling, PHurez, VHymowitz, SGJones, RKropf, JELee, WPMaciejewski, PMMitchell, SARong, HStaker, BLWhitney, JAYeh, SYoung, WBYu, CZhang, JReif, KCurrie, KS Specific Btk inhibition suppresses B cell- and myeloid cell-mediated arthritis. Nat Chem Biol 7:41-50 (2011)  
Target
Name:
Tyrosine-protein kinase BTK
Synonyms:
AGMX1 Agammaglobulinaemia tyrosine kinase B cell progenitor kinase BPK BTK_HUMAN Tyrosine Kinase BTK Tyrosine-protein kinase BTK (BTK)
Type:
Enzyme
Mol. Mass.:
76289.95
Organism:
Homo sapiens (Human)
Description:
Q06187
Residue:
659
  
Inhibitor
Name:
BDBM36519
Synonyms:
5-(3-((4-(tert-Butyl)benzyl)amino)-2-methylphenyl)-1-methyl-3-((4-(morpholine-4-carbonyl)phenyl)amino)pyrazin-2(1H)-one, 5 | CID46942384
Type:
Small organic molecule
Emp. Form.:
C34H39N5O3
Mol. Mass.:
565.7052
SMILES:
Cc1c(NCc2ccc(cc2)C(C)(C)C)cccc1-c1cn(C)c(=O)c(Nc2ccc(cc2)C(=O)N2CCOCC2)n1
: