Target
Heat shock protein HSP 90-beta
Ligand
BDBM34905
Substrate
Meas. Tech.
Fluorescence Polarization Assay
pH
8±0
Kd
202±0.0 nM
Citation
 Yi, FRegan, L A novel class of small molecule inhibitors of Hsp90. ACS Chem Biol 3:645-54 (2008)  
Target
Name:
Heat shock protein HSP 90-beta
Synonyms:
HS90B_HUMAN HSP 90 HSP90B HSPCB Heat shock protein HSP 90 (Hsp90)
Type:
Molecular Chaperone
Mol. Mass.:
83229.45
Organism:
Homo sapiens (Human)
Description:
P08238
Residue:
724
  
Inhibitor
Name:
BDBM34905
Synonyms:
1,6-dimethyl-3-propyl-pyrimido[5,4-e][1,2,4]triazine-5,7-dione 1,6-dimethyl-3-propylpyrimido[5,4-e][1,2,4]triazine-5,7-dione SMR000291200 cid_3164059
Type:
Small organic molecule
Emp. Form.:
C10H13N5O2
Mol. Mass.:
235.2425
SMILES:
CCCc1nn(C)c2nc(=O)n(C)c(=O)c2n1
: