Target
Enoyl-[acyl-carrier-protein] reductase [NADH]
Ligand
BDBM16296
Substrate
Meas. Tech.
Enzyme Inhibition Assay
pH
8±0
Temperature
298.15±0 K
Ki
1.3±0.1 nM
Citation
 Lu, HEngland, Kam Ende, CTruglio, JJLuckner, SReddy, BGMarlenee, NLKnudson, SEKnudson, DLBowen, RAKisker, CSlayden, RATonge, PJ Slow-onset inhibition of the FabI enoyl reductase from francisella tularensis: residence time and in vivo activity. ACS Chem Biol 4:221-31 (2009)  
Target
Name:
Enoyl-[acyl-carrier-protein] reductase [NADH]
Synonyms:
Enoyl-[acyl-carrier-protein] reductase [NADH] (ftuFabl) | fabl
Type:
Enzyme
Mol. Mass.:
27806.39
Organism:
Francisella tularensis
Description:
A0Q794
Residue:
260
  
Inhibitor
Name:
BDBM16296
Synonyms:
5-Pentyl-2-phenoxy-phenol 5-pentyl-2-phenoxyphenol AIDS227445 | PT03
Type:
Small organic molecule
Emp. Form.:
C17H20O2
Mol. Mass.:
256.3395
SMILES:
CCCCCc1ccc(Oc2ccccc2)c(O)c1
: